{"text_format":"1","workbook":"xlsx","n_sheets":16,"sheets":["Output","Input","Considerations","Sortie","Entrée","Considérations","Raw Data","Notes","List","List French","LTCGE","LTCGE French","RRIF","RRIF French","Estate tax rates","Estate tax rates French"],"not_rendered":{"charts":2,"images":12,"macros":1,"external_links":0,"defined_names":248,"comments":2,"pivot_tables":0},"unopened":[],"bounds":{"document_bytes":16777216,"sheet_cells":100000,"rows_first":2000,"rows_last":500,"rows_between":2000,"halvings":0,"cell_chars":16384,"cell_head_chars":4096},"cells_cut":0,"cells_raw":0,"read":"whole","date_system":"1900"}

{"sheet":"Output","index":0,"n_rows":30,"n_cols":17,"rows_kept":30,"cut":false,"hidden":false,"merged":[[27,1,27,16],[28,1,28,16],[29,1,29,16],[11,1,11,16],[17,3,18,6],[22,3,23,6],[16,3,16,6],[21,3,21,6],[15,1,15,16],[17,10,18,15],[19,10,20,15],[21,10,22,15]]}
[]
[]
[]
[]
[]
[]
[]
[]
[]
[null,null,null,null,null,null,null,null,null,null,null,null,null,null,null,null,"v2026.02"]
[]
[null,"You’ve worked your whole life to build your wealth and would like your loved ones to continue enjoying the fruits of your hard work. However, there are taxes and expenses that must be paid in cash before your assets are transferred to your beneficiaries. Those taxes and expenses may be higher than you think and may significantly reduce the size of your estate available to your beneficiaries. Further, if your estate does not have enough liquid assets to pay off those expenses some of the other assets may have to be quickly sold for example: your home, cottage or vehicles."]
[null,"The following chart is an estimation of what could happen to your estate and the cash shortfall you will leave behind."]
[]
[]
{"$rows_left_out":16}
{"sheet":"Input","index":1,"n_rows":148,"n_cols":80,"rows_kept":148,"cut":false,"hidden":false,"merged":[[128,20,128,24],[130,20,130,24],[36,2,36,84],[42,56,42,59],[8,11,8,12],[147,2,147,84],[74,79,74,83],[52,67,52,71],[54,67,54,71],[62,61,62,65],[64,67,64,71],[68,56,68,59],[56,56,56,59],[58,56,58,59],[143,3,143,19],[143,20,143,24],[136,20,136,24],[138,20,138,24],[140,20,140,24],[124,15,124,18],[130,15,130,18],[132,15,132,18],[134,15,134,18],[134,20,134,24],[124,20,124,24],[126,20,126,24],[28,3,28,7],[46,79,46,83],[132,20,132,24],[56,61,56,65],[50,56,50,59],[10,26,10,60],[38,79,38,83],[54,32,54,36],[50,27,50,28],[52,27,52,28],[15,2,15,84],[18,2,18,84],[19,2,19,84],[16,2,16,84],[17,2,17,84],[50,50,50,54],[46,38,46,42],[28,35,28,36],[28,46,28,47],[28,8,28,26],[38,44,38,48],[48,32,48,36],[40,79,40,83],[42,79,42,83],[46,44,46,48],[48,44,48,48],[38,50,38,54],[50,3,50,26],[28,62,28,63],[28,78,28,82],[24,2,24,84],[42,38,42,42],[42,27,42,28],[44,79,44,83],[44,61,44,65],[46,61,46,65],[34,2,34,84],[35,2,35,84],[42,61,42,65],[44,56,44,59],[42,3,42,6],[44,73,44,77],[38,32,38,36],[38,25,38,30],[38,38,38,42],[38,56,38,59],[52,56,52,59],[54,56,54,59],[48,61,48,65],[50,61,50,65],[52,61,52,65],[54,61,54,65],[48,56,48,59],[52,50,52,54],[54,50,54,54],[44,3,44,6],[42,50,42,54],[38,61,38,65],[40,61,40,65],[122,2,122,25],[104,73,104,77],[104,61,104,66],[94,67,94,71],[96,67,97,71],[101,73,101,77],[90,2,90,84],[114,28,114,33],[114,17,114,27],[114,35,114,50],[94,32,94,36],[114,10,114,15],[114,3,114,9],[114,51,114,56],[104,79,104,83],[110,2,110,84],[112,2,112,84],[92,79,92,83],[111,2,111,84],[96,32,97,36],[96,38,97,50],[96,51,97,55],[104,67,104,71],[121,2,121,25],[114,78,114,83],[114,62,114,77],[89,2,89,84],[88,2,88,84],[120,2,120,25],[79,61,79,66],[64,61,64,65],[48,27,48,28],[50,67,50,71],[76,79,76,83],[64,32,64,36],[66,32,66,36],[68,32,68,36],[66,50,66,54],[64,50,64,54],[60,32,60,36],[52,32,52,36],[56,32,56,36],[58,32,58,36],[52,44,52,48],[64,44,64,48],[58,61,58,65],[62,50,62,54],[48,79,48,83],[74,61,74,65],[68,61,68,65],[76,61,76,65],[66,61,66,65],[76,73,76,77],[4,16,4,59],[7,7,7,29],[46,56,46,59],[56,50,56,54],[60,27,60,28],[44,27,44,28],[46,27,46,28],[58,50,58,54],[44,50,44,54],[46,50,46,54],[48,50,48,54],[50,38,50,42],[52,38,52,42],[50,32,50,36],[25,2,25,84],[38,73,38,77],[42,73,42,77],[60,61,60,65],[26,2,26,84],[38,67,38,71],[42,44,42,48],[50,44,50,48],[48,3,48,26],[48,38,48,42],[82,26,82,60],[66,44,66,48],[68,44,68,48],[64,38,64,42],[60,56,60,59],[64,56,64,59],[66,56,66,59],[60,50,60,54],[66,38,66,42],[68,38,68,42],[68,50,68,54],[62,27,62,28],[62,32,62,36],[48,67,48,71],[79,79,79,83],[79,73,79,77],[58,79,58,83],[60,79,60,83],[62,79,62,83],[64,79,64,83],[72,73,72,77],[74,73,74,77],[70,73,70,77],[56,67,56,71],[62,67,62,71],[68,79,68,83],[66,79,66,83],[66,67,66,71],[68,67,68,71],[58,67,58,71],[60,67,60,71],[79,67,79,71],[50,79,50,83],[52,79,52,83],[54,79,54,83],[56,79,56,83]]}
[]
[]
[]
[]
[null,null,null,null,null,null,null,null,null,null,null,null,null,null,null,null,"Do not send this spreadsheet to your clients. Only the pdf printouts can be distributed."]
[]
[]
[null,null,"Prepared by:"]
[null,null,"Include in printouts:",null,null,null,null,null,null,null,null,"No"]
[]
[null,null,null,null,null,null,null,null,null,null,null,null,null,null,null,null,null,null,null,null,null,null,null,null,null,null,"ESTATE TRANSFER ESTIMATE v2026.02"]
[]
[]
[]
[]
{"$rows_left_out":134}
{"sheet":"Considerations","index":2,"n_rows":47,"n_cols":4,"rows_kept":47,"cut":false,"hidden":false,"merged":[[46,3,46,76],[34,3,34,76],[35,3,35,76],[36,3,36,76],[37,3,37,76],[38,3,38,76],[39,3,39,76],[40,3,40,76],[41,3,41,76],[42,3,42,76],[43,3,43,76],[44,3,44,76],[45,3,45,76],[23,3,23,76],[32,2,32,76],[14,2,14,76],[16,2,16,76],[18,3,18,76],[19,3,19,76],[20,3,20,76],[21,3,21,76],[22,3,22,76],[24,3,24,76],[30,2,30,76],[15,2,15,76],[31,2,31,76]]}
[]
[]
[]
[]
[]
[]
[]
[]
[]
[]
[]
[]
[]
[]
[]
{"$rows_left_out":33}
{"sheet":"Sortie","index":3,"n_rows":29,"n_cols":17,"rows_kept":29,"cut":false,"hidden":true,"merged":[[26,1,26,16],[27,1,27,16],[28,1,28,16],[17,3,18,6],[22,3,23,6],[11,1,11,16],[15,1,15,16],[16,3,16,6],[21,3,21,6],[17,10,18,15],[19,10,20,15],[21,10,22,15]]}
[]
[]
[]
[null,"Quel patrimoine laissez-vous réellement ?"]
[]
[]
[]
[]
[]
[null,null,null,null,null,null,null,null,null,null,null,null,null,null,null,null,"v2026.02"]
[]
[null,"Vous avez passé votre vie à bâtir votre patrimoine et vous aimeriez que vos proches continuent de récolter les fruits de votre labeur. Toutefois, il y aura de l’impôt et des frais à payer en espèces avant de procéder au transfert de votre actif à vos bénéficiaires. Les frais et l’impôt peuvent être plus élevés que vous ne le croyez et réduire considérablement le montant de la succession qui revient à vos bénéficiaires. De plus, si votre succession ne dispose pas de liquidités suffisantes pour payer ces dépenses, certains biens pourraient devoir être vendus rapidement, notamment votre maison, votre chalet ou vos véhicules."]
[null,"Le graphique ci-dessous représente une estimation de ce qui pourrait arriver à votre succession ainsi que le manque de fonds pour vos bénéficiaires."]
[]
[]
{"$rows_left_out":15}
{"sheet":"Entrée","index":4,"n_rows":146,"n_cols":84,"rows_kept":146,"cut":false,"hidden":true,"merged":[[92,83,92,87],[68,71,68,75],[145,2,145,88],[58,3,59,34],[126,20,126,27],[128,20,128,27],[130,20,130,27],[109,2,109,88],[119,2,119,28],[112,82,112,87],[128,15,128,18],[130,15,130,18],[132,15,132,18],[132,20,132,27],[112,67,112,81],[122,15,123,18],[122,20,122,27],[124,20,124,27],[112,35,112,40],[102,83,102,87],[118,2,118,28],[120,2,120,28],[141,3,141,19],[141,20,141,27],[134,20,134,27],[136,20,136,27],[138,20,138,27],[112,60,112,65],[102,77,102,81],[102,65,102,70],[94,71,94,75],[112,42,112,59],[112,17,112,34],[96,71,97,75],[108,2,108,88],[110,2,110,88],[94,40,94,44],[96,40,97,44],[112,10,112,15],[112,3,112,9],[96,64,97,68],[99,40,99,44],[99,46,99,63],[99,64,99,68],[99,71,99,75],[46,65,46,69],[90,2,90,88],[58,65,58,69],[60,65,60,69],[76,65,76,69],[79,65,79,70],[62,35,62,39],[64,35,64,39],[68,41,68,45],[58,83,58,87],[60,83,60,87],[62,83,62,87],[64,83,64,87],[58,71,58,75],[60,71,60,75],[70,77,70,81],[72,77,72,81],[66,71,66,75],[66,83,66,87],[64,59,64,63],[68,83,68,87],[74,83,74,87],[76,83,76,87],[64,71,64,75],[48,83,48,87],[50,83,50,87],[52,83,52,87],[54,83,54,87],[89,2,89,88],[88,2,88,88],[62,30,62,31],[64,53,64,57],[66,53,66,57],[60,30,60,31],[66,35,66,39],[68,35,68,39],[60,53,60,57],[62,53,62,57],[60,35,60,39],[56,71,56,75],[62,71,62,75],[76,77,76,81],[79,83,79,87],[79,77,79,81],[74,77,74,81],[66,59,66,63],[48,65,48,69],[50,3,50,29],[44,83,44,87],[46,83,46,87],[56,83,56,87],[38,83,38,87],[40,83,40,87],[42,83,42,87],[36,2,36,88],[50,30,50,31],[44,3,44,6],[46,41,46,45],[44,30,44,31],[46,30,46,31],[44,53,44,57],[46,53,46,57],[48,3,48,29],[48,35,48,39],[48,53,48,57],[50,53,50,57],[52,53,52,57],[54,53,54,57],[50,35,50,39],[52,35,52,39],[54,35,54,39],[38,77,38,81],[28,82,28,86],[15,2,15,88],[18,2,18,88],[19,2,19,88],[24,2,24,88],[26,2,26,88],[25,2,25,88],[16,2,16,88],[17,2,17,88],[28,36,28,37],[28,8,28,24],[28,51,28,52],[28,66,28,67],[60,59,60,63],[56,53,56,57],[64,3,65,34],[64,41,64,45],[66,41,66,45],[48,30,48,31],[35,2,35,88],[38,65,38,69],[40,65,40,69],[42,65,42,69],[42,41,42,45],[38,35,38,39],[38,28,38,33],[38,41,38,45],[38,59,38,63],[42,59,42,63],[38,53,38,57],[42,53,42,57],[42,3,42,6],[42,30,42,31],[50,71,50,75],[52,71,52,75],[38,47,38,51],[42,77,42,81],[58,53,58,57],[56,35,56,39],[4,9,4,61],[8,15,8,16],[44,65,44,69],[58,35,58,39],[7,7,7,29],[10,26,10,64],[50,41,50,45],[52,41,52,45],[56,59,56,63],[58,59,58,63],[44,59,44,63],[46,59,46,63],[50,65,50,69],[52,65,52,69],[54,65,54,69],[50,59,50,63],[52,59,52,63],[54,59,54,63],[48,59,48,63],[48,41,48,45],[34,2,34,88],[38,71,38,75],[54,71,54,75],[68,53,68,57],[42,47,42,51],[52,30,52,31],[79,71,79,75],[102,71,102,75],[83,26,83,64],[44,77,44,81],[48,71,48,75],[62,65,62,69],[64,65,64,69],[66,65,66,69],[68,65,68,69],[74,65,74,69],[68,59,68,63],[56,65,56,69],[46,47,46,51],[48,47,48,51],[50,47,50,51],[52,47,52,51],[66,47,66,51],[68,47,68,51],[64,47,64,51],[96,46,97,63]]}
[]
[]
[]
[]
[null,null,null,null,null,null,null,null,null,"N’envoyez pas ce tableur à vos clients. Seuls les documents imprimés en format PDF peuvent être distribués."]
[]
[]
[null,null,"Préparé par:"]
[null,null," Inclure dans les impressions:",null,null,null,null,null,null,null,null,null,null,null,null,"Non"]
[]
[null,null,null,null,null,null,null,null,null,null,null,null,null,null,null,null,null,null,null,null,null,null,null,null,null,null,"ESTIMATION DU TRANSFERT DE PATRIMOINE, version 2026.02"]
[]
[]
[]
[]
{"$rows_left_out":132}
{"sheet":"Considérations","index":5,"n_rows":47,"n_cols":4,"rows_kept":47,"cut":false,"hidden":true,"merged":[[14,2,14,76],[15,2,15,76],[16,2,16,76],[18,3,18,76],[19,3,19,76],[38,3,38,76],[20,3,20,76],[21,3,21,76],[22,3,22,76],[23,3,23,76],[30,2,30,76],[31,2,31,76],[32,2,32,76],[34,3,34,76],[35,3,35,76],[36,3,36,76],[37,3,37,76],[24,3,24,76],[46,3,46,76],[39,3,39,76],[40,3,40,76],[41,3,41,76],[42,3,42,76],[43,3,43,76],[44,3,44,76],[45,3,45,76]]}
[]
[]
[]
[]
[]
[]
[]
[]
[]
[]
[]
[]
[]
[]
[]
{"$rows_left_out":33}
{"sheet":"Raw Data","index":6,"n_rows":39,"n_cols":9,"rows_kept":39,"cut":false,"hidden":true,"merged":[]}
[]
[null,"English"]
[null,null,null,null,null,null,"M"]
[null,"Your beneficiary likely gets",{"$f":"C19","v":{"$error":"#N/A"}},null,null,"Liquid",{"$f":"Input!K115","v":0},{"$f":"G4","v":0},{"$f":"IF($B$2=\"French\",SUBSTITUTE(TEXT(H4/100000,\"# ##0.0\"),\".\",\",\")&\" M$\",H4)","v":0}]
[null,"Your estate pays in taxes etc.",{"$f":"C20","v":{"$error":"#N/A"}},null,null,"Non-Liquid",{"$f":"C7-G4","v":0},{"$f":"G5","v":0},{"$f":"IF($B$2=\"French\",SUBSTITUTE(TEXT(H5/100000,\"# ##0.0\"),\".\",\",\")&\" M$\",H5)","v":0}]
[]
[null,null,{"$f":"Input!$CB$80","v":0}]
[]
[]
[null,"Votre bénéficiaire reçoit",{"$f":"C4","v":{"$error":"#N/A"}},{"$f":"IF($B$2=\"French\",SUBSTITUTE(TEXT(C10/100000,\"# ##0.0\"),\".\",\",\")&\" M$\",C10)","v":{"$error":"#N/A"}}]
[null,"Votre succession paie en impôts, etc",{"$f":"C5","v":{"$error":"#N/A"}},{"$f":"IF($B$2=\"French\",SUBSTITUTE(TEXT(C11/100000,\"# ##0.0\"),\".\",\",\")&\" M$\",C11)","v":{"$error":"#N/A"}}]
[]
[]
[]
[]
{"$rows_left_out":25}
{"sheet":"Notes","index":7,"n_rows":44,"n_cols":2,"rows_kept":44,"cut":false,"hidden":true,"merged":[]}
[]
["Nehal"]
["Done","1. The text in the “about this calculator should be changed as under:"]
[null,"The purpose of this calculator is to estimate the income tax and estate tax that may become payable upon your death based on the assets you may own at that time and show its impact on your estate. The calculation assumes that you are either single or last to die spouse/common law-partner."]
["Done","2. The width of client information section should be expanded to match the size of other sections. May be client name, age and comparison age would appear in one row, and the province and marginal tax rate would appear in next row."]
[null,"3. If possible design the calculator such that if the client’s current age is 72 or higher, the RRSP row does not appear."]
["Will see what I can do during the coding part of this calculator. Might be able to hide the RRSP row altogether when the age is high enough."]
["Done","4. The formulas in “data entry” tab of the excel file Is end may be directly included in this input tab. The we will not need data entry tab."]
["It will","5. The column width needs to be adjusted so that all content fit in either portrait or landscape orientation."]
["It will","6. Also the $ amount cell should adjust auto-adjust the width based on the value entered/calculated. The value will be without decimals (except for %)."]
["Done","7. Please expand the width of deductions section so that columns align with the section above."]
[null,"8. If we are going with pie chart, the it may be added besides the “liabilities and expenses” section."]
["Done","9. The “total” in “liabilities and expenses” section may be retitled as “expected shrinkage in estate due liabilities, expenses and taxes”. That may help lead the conversation to potential insurance need."]
[null,"10. Mitch / Jean Guy – please suggest a client-friendly name for this calculator based on your experience in the field. Not sure if we want to call the final version “terminal tax calculator”."]
[]
{"$rows_left_out":30}
{"sheet":"List","index":8,"n_rows":72,"n_cols":4,"rows_kept":72,"cut":false,"hidden":true,"merged":[]}
["Capital gains inclusion factor",0.5]
[]
["Province","Estate tax"]
[]
["AB",{"$f":"+'Estate tax rates'!H7","v":0},"Alberta",{"$f":"B5","v":0}]
["BC",{"$f":"+'Estate tax rates'!H12","v":0},"British Columbia",{"$f":"B6","v":0}]
["MB",{"$f":"+'Estate tax rates'!H15","v":0},"Manitoba",0]
["NB",{"$f":"+'Estate tax rates'!H22","v":0},"New Brunswick",0]
["NL",{"$f":"+'Estate tax rates'!H26","v":0},"Newfoundland & Labrador",0]
["NT",{"$f":"+'Estate tax rates'!H33","v":0},"Northwest Territories",0]
["NS",{"$f":"+'Estate tax rates'!H40","v":0},"Nova Scotia",0]
["NU",{"$f":"+'Estate tax rates'!H47","v":0},"Nunavut",0]
["ON ",{"$f":"+'Estate tax rates'!H51","v":0},"Ontario",0]
["PE",{"$f":"+'Estate tax rates'!H58","v":0},"Prince Edward Island",0]
["QC",{"$f":"+'Estate tax rates'!H61","v":0},"Quebec",0]
{"$rows_left_out":58}
{"sheet":"List French","index":9,"n_rows":72,"n_cols":4,"rows_kept":72,"cut":false,"hidden":true,"merged":[]}
["Capital gains inclusion factor",{"$f":"+List!B1","v":0.5}]
[]
["Province","Estate tax"]
[]
["AB",{"$f":"+'Estate tax rates French'!H7","v":0},"Alberta",{"$f":"B5","v":0}]
["BC",{"$f":"+'Estate tax rates French'!H12","v":0},"British Columbia",{"$f":"B6","v":0}]
["MB",{"$f":"+'Estate tax rates French'!H15","v":0},"Manitoba",0]
["NB",{"$f":"+'Estate tax rates French'!H22","v":0},"New Brunswick",0]
["NL",{"$f":"+'Estate tax rates French'!H26","v":0},"Newfoundland & Labrador",0]
["NT",{"$f":"+'Estate tax rates French'!H33","v":0},"Northwest Territories",0]
["NS",{"$f":"+'Estate tax rates French'!H40","v":0},"Nova Scotia",0]
["NU",{"$f":"+'Estate tax rates French'!H47","v":0},"Nunavut",0]
["ON ",{"$f":"+'Estate tax rates French'!H51","v":0},"Ontario",0]
["PE",{"$f":"+'Estate tax rates French'!H58","v":0},"Prince Edward Island",0]
["QC",{"$f":"+'Estate tax rates French'!H61","v":0},"Quebec",0]
{"$rows_left_out":58}
{"sheet":"LTCGE","index":10,"n_rows":102,"n_cols":11,"rows_kept":102,"cut":false,"hidden":true,"merged":[]}
["Year","Age","LTCGE limit","LTCGD limit",null,null,null,null,"Inflation factor",0.03,{"$f":"SUBSTITUTE(TEXT(J1*10,\"0.0%\"),\".\",\",\")","v":"30,0%"}]
[{"$f":"YEAR(NOW())","v":2026},{"$f":"Input!$AJ$29","v":0},1275000,{"$f":"+C2*1/2*100%","v":637500}]
[{"$f":"+A2+1","v":2027},{"$f":"+B2+1","v":1},{"$f":"+C2+(C2*$J$1)","v":1313250},{"$f":"+C3*1/2*100%","v":656625}]
[{"$f":"+A3+1","v":2028},{"$f":"+B3+1","v":2},{"$f":"+C3+(C3*$J$1)","v":1352647.5},676323.75]
[2029,3,1393226.925,696613.46250000002]
[2030,4,1435023.73275,717511.86637499998]
[2031,5,1478074.4447325,739037.22236625]
[2032,6,1522416.6780744749,761208.33903723746]
[2033,7,1568089.1784167092,784044.58920835459]
[2034,8,1615131.8537692104,807565.9268846052]
[2035,9,1663585.8093822866,831792.90469114331]
[2036,10,1713493.3836637551,856746.69183187757]
[2037,11,1764898.1851736677,882449.09258683387]
[2038,12,1817845.1307288778,908922.56536443892]
[2039,13,1872380.4846507441,936190.24232537206]
{"$rows_left_out":88}
{"sheet":"LTCGE French","index":11,"n_rows":102,"n_cols":4,"rows_kept":102,"cut":false,"hidden":true,"merged":[]}
["Year","Age","LTCGE limit","LTCGD limit"]
[{"$f":"YEAR(NOW())","v":2026},{"$f":"Entrée!$AK$29","v":0},{"$f":"+LTCGE!C2","v":1275000},{"$f":"+C2*1/2*100%","v":637500}]
[{"$f":"+A2+1","v":2027},{"$f":"+B2+1","v":1},{"$f":"+LTCGE!C3","v":1313250},{"$f":"+C3*1/2*100%","v":656625}]
[{"$f":"+A3+1","v":2028},2,{"$f":"+LTCGE!C4","v":1352647.5},676323.75]
[2029,3,{"$f":"+LTCGE!C5","v":1393226.925},696613.46250000002]
[2030,4,{"$f":"+LTCGE!C6","v":1435023.73275},717511.86637499998]
[2031,5,{"$f":"+LTCGE!C7","v":1478074.4447325},739037.22236625]
[2032,6,{"$f":"+LTCGE!C8","v":1522416.6780744749},761208.33903723746]
[2033,7,{"$f":"+LTCGE!C9","v":1568089.1784167092},784044.58920835459]
[2034,8,{"$f":"+LTCGE!C10","v":1615131.8537692104},807565.9268846052]
[2035,9,{"$f":"+LTCGE!C11","v":1663585.8093822866},831792.90469114331]
[2036,10,{"$f":"+LTCGE!C12","v":1713493.3836637551},856746.69183187757]
[2037,11,{"$f":"+LTCGE!C13","v":1764898.1851736677},882449.09258683387]
[2038,12,{"$f":"+LTCGE!C14","v":1817845.1307288778},908922.56536443892]
[2039,13,{"$f":"+LTCGE!C15","v":1872380.4846507441},936190.24232537206]
{"$rows_left_out":88}
{"sheet":"RRIF","index":12,"n_rows":43,"n_cols":6,"rows_kept":43,"cut":false,"hidden":true,"merged":[]}
[]
["Age on January 1st","RRIF factor","Value on January 1st","Minimum withdrawal","Annual growth","Cl.bal."]
[]
[71,5.28E-2,{"$f":"+IF(Eng_Client_Age<72,IF(AND(Eng_Cont_Yrs_RRSP>0,Eng_Cont_Yrs_RRSP<72-Eng_Client_Age),FV(Eng_Rate_RRSP,71-Eng_Client_Age-Eng_Cont_Yrs_RRSP,0,-FV(Eng_Rate_RRSP,Eng_Cont_Yrs_RRSP,-Eng_Cont_RRSP,-Eng_FMV_RRSP,1),1),FV(Eng_Rate_RRSP,71-Eng_Client_Age,-Eng_Cont_RRSP,-Eng_FMV_RRSP,1)),IF(A4=Eng_Client_Age,Eng_FMV_RRIF,0))","v":0},{"$f":"+C4*B4","v":0},{"$f":"+(C4-D4)*IF(Eng_Rate_RRIF>0,Eng_Rate_RRIF,Eng_Rate_RRSP)","v":0},{"$f":"+C4-D4+E4","v":0}]
[{"$f":"+A4+1","v":72},5.3999999999999999E-2,{"$f":"+IF(Eng_Client_Age=A5,Eng_FMV_RRIF,0)+F4","v":0},{"$f":"+C5*B5","v":0},0,{"$f":"+C5-D5+E5","v":0}]
[{"$f":"+A5+1","v":73},5.5300000000000002E-2,0,0,0,{"$f":"+C6-D6+E6","v":0}]
[74,5.67E-2,0,0,0,0]
[75,5.8200000000000002E-2,0,0,0,0]
[76,5.9799999999999999E-2,0,0,0,0]
[77,6.1699999999999998E-2,0,0,0,0]
[78,6.3600000000000004E-2,0,0,0,0]
[79,6.5799999999999997E-2,0,0,0,0]
[80,6.8199999999999997E-2,0,0,0,0]
[81,7.0800000000000002E-2,0,0,0,0]
[82,7.3800000000000004E-2,0,0,0,0]
{"$rows_left_out":29}
{"sheet":"RRIF French","index":13,"n_rows":43,"n_cols":6,"rows_kept":43,"cut":false,"hidden":true,"merged":[]}
[]
["Age on January 1st","RRIF factor","Value on January 1st","Minimum withdrawal","Annual growth","Cl.bal."]
[]
[{"$f":"+RRIF!A4","v":71},{"$f":"+RRIF!B4","v":5.28E-2},{"$f":"+IF(Fre_Client_Age<72,IF(AND(Fre_Cont_Yrs_RRSP>0,Fre_Cont_Yrs_RRSP<72-Fre_Client_Age),FV(Fre_Rate_RRSP,71-Fre_Client_Age-Fre_Cont_Yrs_RRSP,0,-FV(Fre_Rate_RRSP,Fre_Cont_Yrs_RRSP,-Fre_Cont_RRSP,-Fre_FMV_RRSP,1),1),FV(Fre_Rate_RRSP,71-Fre_Client_Age,-Fre_Cont_RRSP,-Fre_FMV_RRSP,1)),IF(A4=Fre_Client_Age,Fre_FMV_RRIF,0))","v":0},{"$f":"+C4*B4","v":0},{"$f":"+(C4-D4)*IF(Fre_Rate_RRIF>0,Fre_Rate_RRIF,Fre_Rate_RRSP)","v":0},{"$f":"+C4-D4+E4","v":0}]
[{"$f":"+RRIF!A5","v":72},{"$f":"+RRIF!B5","v":5.3999999999999999E-2},{"$f":"+IF(Fre_Client_Age=A5,Fre_FMV_RRIF,0)+F4","v":0},{"$f":"+C5*B5","v":0},0,{"$f":"+C5-D5+E5","v":0}]
[{"$f":"+RRIF!A6","v":73},{"$f":"+RRIF!B6","v":5.5300000000000002E-2},0,0,0,0]
[{"$f":"+RRIF!A7","v":74},{"$f":"+RRIF!B7","v":5.67E-2},0,0,0,0]
[{"$f":"+RRIF!A8","v":75},{"$f":"+RRIF!B8","v":5.8200000000000002E-2},0,0,0,0]
[{"$f":"+RRIF!A9","v":76},{"$f":"+RRIF!B9","v":5.9799999999999999E-2},0,0,0,0]
[{"$f":"+RRIF!A10","v":77},{"$f":"+RRIF!B10","v":6.1699999999999998E-2},0,0,0,0]
[{"$f":"+RRIF!A11","v":78},{"$f":"+RRIF!B11","v":6.3600000000000004E-2},0,0,0,0]
[{"$f":"+RRIF!A12","v":79},{"$f":"+RRIF!B12","v":6.5799999999999997E-2},0,0,0,0]
[{"$f":"+RRIF!A13","v":80},{"$f":"+RRIF!B13","v":6.8199999999999997E-2},0,0,0,0]
[{"$f":"+RRIF!A14","v":81},{"$f":"+RRIF!B14","v":7.0800000000000002E-2},0,0,0,0]
[{"$f":"+RRIF!A15","v":82},{"$f":"+RRIF!B15","v":7.3800000000000004E-2},0,0,0,0]
{"$rows_left_out":29}
{"sheet":"Estate tax rates","index":14,"n_rows":69,"n_cols":10,"rows_kept":69,"cut":false,"hidden":true,"merged":[[0,1,0,2],[0,4,0,5]]}
[null,"Range",null,null,"Rate",null,null,"Probate fees",null,{"$f":"(Input!$CB$80-Input!$CB$93)","v":0}]
["AB",0,10000,null,35,null,null,{"$f":"+IF(AND($J$1>B2,$J$1<B3),E2,0)","v":0},null,"https://www.alberta.ca/court-fees.aspx"]
[null,{"$f":"+C2+0.01","v":10000.01},25000,null,135,null,null,{"$f":"+IF(AND($J$1>C2,$J$1<B4),E3,0)","v":0}]
[null,{"$f":"+C3+0.01","v":25000.01},125000,null,275,null,null,{"$f":"+IF(AND($J$1>C3,$J$1<B5),E4,0)","v":0}]
[null,{"$f":"+C4+0.01","v":125000.01},250000,null,400,null,null,{"$f":"+IF(AND(J1>C4,J1<B6),E5,0)","v":0}]
[null,{"$f":"+C5+0.01","v":250000.01},null,null,525,null,null,{"$f":"+IF(J1>C5,E6,0)","v":0}]
[null,null,null,null,null,null,null,{"$f":"SUM(H2:H6)","v":0}]
[]
["BC",0,25000,null,0,null,null,{"$f":"+IF(AND(J1>B9,J1<B10),E9,0)","v":0},null,"https://www.bclaws.gov.bc.ca/civix/document/id/complete/statreg/00_99004_01#section2"]
[null,{"$f":"+C9+0.01","v":25000.01},50000,null,6,"per 1000 or part thereof + $200 filing fees",null,{"$f":"+IF(J1<'Estate tax rates'!B10,0,IF(AND(J1>C9,J1<B11),+(CEILING((J1-C9),1000)/1000*E10)+200,(C10-C9)/1000*E10))","v":0}]
[null,{"$f":"+C10+0.01","v":50000.01},null,null,14,"per 1000 or part thereof + $200 filing fees",null,{"$f":"+IF(J1>C10,+(CEILING((J1-C10),1000)/1000*E11)+200,0)","v":0}]
[null,null,null,null,null,null,null,{"$f":"SUM(H9:H11)","v":0}]
[]
["MB",null,null,null,0,null,null,{"$f":"+E14","v":0},null,"https://www.manitobacourts.mb.ca/site/assets/files/1152/2020-11-06_notice_-_elimination_of_probate_charges.pdf"]
[null,null,null,null,null,null,null,{"$f":"SUM(H14)","v":0}]
{"$rows_left_out":55}
{"sheet":"Estate tax rates French","index":15,"n_rows":69,"n_cols":10,"rows_kept":69,"cut":false,"hidden":true,"merged":[[0,1,0,2],[0,4,0,5]]}
[null,"Range",null,null,"Rate",null,null,"Probate fees",null,{"$f":"(Entrée!$CF$80-Entrée!$CF$93)","v":0}]
["AB",{"$f":"+'Estate tax rates'!B2","v":0},{"$f":"+'Estate tax rates'!C2","v":10000},null,{"$f":"+'Estate tax rates'!E2","v":35},null,null,{"$f":"+IF(AND($J$1>B2,$J$1<B3),E2,0)","v":0},null,"https://www.alberta.ca/court-fees.aspx"]
[null,{"$f":"+'Estate tax rates'!B3","v":10000.01},{"$f":"+'Estate tax rates'!C3","v":25000},null,{"$f":"+'Estate tax rates'!E3","v":135},null,null,{"$f":"+IF(AND($J$1>C2,$J$1<B4),E3,0)","v":0}]
[null,{"$f":"+'Estate tax rates'!B4","v":25000.01},{"$f":"+'Estate tax rates'!C4","v":125000},null,{"$f":"+'Estate tax rates'!E4","v":275},null,null,{"$f":"+IF(AND($J$1>C3,$J$1<B5),E4,0)","v":0}]
[null,{"$f":"+'Estate tax rates'!B5","v":125000.01},{"$f":"+'Estate tax rates'!C5","v":250000},null,{"$f":"+'Estate tax rates'!E5","v":400},null,null,{"$f":"+IF(AND(J1>C4,J1<B6),E5,0)","v":0}]
[null,{"$f":"+'Estate tax rates'!B6","v":250000.01},null,null,{"$f":"+'Estate tax rates'!E6","v":525},null,null,{"$f":"+IF(J1>C5,E6,0)","v":0}]
[null,null,null,null,null,null,null,{"$f":"SUM(H2:H6)","v":0}]
[]
["BC",{"$f":"+'Estate tax rates'!B9","v":0},{"$f":"+'Estate tax rates'!C9","v":25000},null,{"$f":"+'Estate tax rates'!E9","v":0},null,null,{"$f":"+IF(AND(J1>B9,J1<B10),E9,0)","v":0},null,"https://www.bclaws.gov.bc.ca/civix/document/id/complete/statreg/00_99004_01#section2"]
[null,{"$f":"+'Estate tax rates'!B10","v":25000.01},{"$f":"+'Estate tax rates'!C10","v":50000},null,{"$f":"+'Estate tax rates'!E10","v":6},"per 1000 or part thereof + $200 filing fees",null,{"$f":"+IF(J1<'Estate tax rates French'!B10,0,IF(AND(J1>C9,J1<B11),+(CEILING((J1-C9),1000)/1000*E10)+200,(C10-C9)/1000*E10))","v":0}]
[null,{"$f":"+'Estate tax rates'!B11","v":50000.01},null,null,{"$f":"+'Estate tax rates'!E11","v":14},"per 1000 or part thereof + $200 filing fees",null,{"$f":"+IF(J1>C10,+(CEILING((J1-C10),1000)/1000*E11)+200,0)","v":0}]
[null,null,null,null,null,null,null,{"$f":"SUM(H9:H11)","v":0}]
[]
["MB",null,null,null,{"$f":"+'Estate tax rates'!E14","v":0},null,null,{"$f":"+E14","v":0},null,"https://www.manitobacourts.mb.ca/site/assets/files/1152/2020-11-06_notice_-_elimination_of_probate_charges.pdf"]
[null,null,null,null,null,null,null,{"$f":"SUM(H14)","v":0}]
{"$rows_left_out":54}